USDA
type: Concept

USDA/FS/WFAS
in scheme: providers
definition: The USDA Forest Service Wildland Fire Assessment System is an internet-based information system that provides a national view of weather and fire potential, including national fire danger and weather maps and satellite-derived Greenness maps. Website: http://www.wfas.net/
type: Concept