TROPICAL CYCLONES
type: Concept

TYPHOONS
change note: 2012-07-02 09:07:56.0 [tbs1979] insert Definition (id: null text: A severe tropical cyclone in the western North Pacific. language code: en);
change note: 2012-06-27 14:52:44.0 [tbs1979] Insert Concept add broader relation (TYPHOONS [bd5c19e4-b25a-48b2-ad9d-4596a0ba67de,40229] - TROPICAL CYCLONES [00fc45e0-400d-4024-a82a-4d6544735f64,40225]);
in scheme: sciencekeywords
definition: A severe tropical cyclone in the western North Pacific.
type: Concept