ATMOSPHERIC PRESSURE
type: Concept

PRESSURE THICKNESS
in scheme: sciencekeywords
definition: In synoptic meteorology, the vertical depth, measured in geometric or geopotential units, of a layer in the atmosphere bounded by two different constant-pressure surfaces.
type: Concept