CANADA
type: Concept

CA/EC/EPS/PDB/NPRI
in scheme: providers
definition: Environment Canada's mandate is to preserve and enhance the quality of the natural environment; conserve Canada's renewable resources; conserve and protect Canada's water resources; forecast weather and environmental change; enforce rules relating to boundary waters; and coordinate environmental policies and programs for the federal government. Summary Provided by: http://www.ec.gc.ca/default.asp?lang=En&n=ECBC00D9-1
type: Concept