COLOMBIA
type: Concept

CO/MINAMBIENTE/INVEMAR
in scheme: providers
definition: he program BEM conducts research that contributes to increase awareness of the marine and coastal biodiversity, covering from the taxonomy and biology of marine organisms, as a basis for knowledge management and sustainable use of biodiversity. Summary Provided By: http://translate.google.com/translate?hl=en&sl=es&u=http://www.invemar.org.co/&sa=X&oi=translate&resnum=1&ct=result&prev=/search%3Fq%3DInstituto%2Bde%2BInvestigaciones%2BMarinas%2By%2BCosteras,%2B%2527Jose%2BBenito%2BVives%2Bde%2BAndreis%2527,%2BMinisterio%2Bde%2BAmbiente,%2BVivienda%2BY%2BDesarrollo%2BTerritorial%26hl%3Den%26sa%3DG
type: Concept