CONSORTIA/INSTITUTIONS
type: Concept

PODPAC Development Group
change note: 2021-01-20 15:13:20.0 [tstevens] insert Definition (id: null text: Pipeline for Observational Data Processing Analysis and Collaboration PODPAC is a python library that builds on the scientific python ecosystem to enable simple, reproducible geospatial analyses that run locally or in the cloud. language code: en); insert Resource (id: null type: provider url: https://podpac.org/);
change note: 2021-01-20 15:11:50.0 [tstevens] Insert Concept add broader relation (PODPAC Development Group [bef8c3b0-cee1-4128-8753-90f8d716555f,560817] - CONSORTIA/INSTITUTIONS [aef2fc80-def0-46a4-9259-9dc37e80ed08,533799]);
in scheme: providers
definition: Pipeline for Observational Data Processing Analysis and Collaboration PODPAC is a python library that builds on the scientific python ecosystem to enable simple, reproducible geospatial analyses that run locally or in the cloud.
type: Concept