MSC
change note: 2018-07-05 14:01:18.0 [mmorahan] Insert Concept add broader relation (MSC [bf3e5771-7ca2-4083-a5e2-9be6a28fe588,367779] - Cameras [d322ae9d-bde0-448f-948d-777aef096eb6,348777]);
change note: 2018-07-05 14:03:09.0 [mmorahan] insert AltLabel (id: null category: primary text: Multi-Spectral Camera language code: en); insert Definition (id: null text: MSC is a joint development of KARI with ELOP (Electro Optics Industries Ltd. of Rehovot, Israel) and OHB-System, Bremen, Germany. The objective is to collect high-resolution panchromatic and multispectral imagery of the Earth's surface (simultaneous observation). MSC is an optoelectronic linear pushbroom instrument with a single nadir-pointing telescope. The Pan band has a spectral range of 500-900 nm, the four MS bands are in the 450-900 nm range. The GSD (Ground Sample Distance) of the Pan data is 1 m (GSD), the MS data has a GSD of 4 m. The swath width is 15 km. A FOR (Field of Regard) of ±30º in pitch and up to ±56º in the roll direction is provided through spacecraft body pointing. MSC has a duty cycle of 20%. The EFL (Effective Focal Length) of the optics subsystem is 9000 mm for the Pan band, and 2250 mm for the MS bands. Parameter Value Parameter Value Spectral range Pan 500-900 nm Spectral range MS 450-520, 520-600, 630-690, 760-900 nm GSD (Ground Sample Distance) Pan (1 m), MS (4 m) Spectral bands 1 Pan + 4 MS Swath width, FOV 15 km at nadir, ±0.62º SNR > 100 MTF (Modulation Transfer Function) > 15% for Pan, 20% for MS Data quantization Payload power, mass 10 bit 350 W, 150 kg Detector line array 15,000 pixels (Pan) Detector line array 3,750 pixels (MS) language code: en);
change note: 2019-02-21 05:13:35.0 [mmorahan] insert WeightedRelation (id: null related concept uuid: 88d9cd91-a26e-467a-9554-c5d927540421 relationship type: null relationship value: null generated by: null);
definition: MSC is a joint development of KARI with ELOP (Electro Optics Industries Ltd. of Rehovot, Israel) and OHB-System, Bremen, Germany. The objective is to collect high-resolution panchromatic and multispectral imagery of the Earth's surface (simultaneous observation). MSC is an optoelectronic linear pushbroom instrument with a single nadir-pointing telescope. The Pan band has a spectral range of 500-900 nm, the four MS bands are in the 450-900 nm range. The GSD (Ground Sample Distance) of the Pan data is 1 m (GSD), the MS data has a GSD of 4 m. The swath width is 15 km. A FOR (Field of Regard) of ±30º in pitch and up to ±56º in the roll direction is provided through spacecraft body pointing. MSC has a duty cycle of 20%. The EFL (Effective Focal Length) of the optics subsystem is 9000 mm for the Pan band, and 2250 mm for the MS bands. Parameter Value Parameter Value Spectral range Pan 500-900 nm Spectral range MS 450-520, 520-600, 630-690, 760-900 nm GSD (Ground Sample Distance) Pan (1 m), MS (4 m) Spectral bands 1 Pan + 4 MS Swath width, FOV 15 km at nadir, ±0.62º SNR > 100 MTF (Modulation Transfer Function) > 15% for Pan, 20% for MS Data quantization Payload power, mass 10 bit 350 W, 150 kg Detector line array 15,000 pixels (Pan) Detector line array 3,750 pixels (MS)
type: Concept
in scheme: instruments

Cameras
type: Concept