FLOODS
type: Concept

FLOOD FREQUENCY
change note: 2016-04-04 09:16:38.0 [gee-cee] update Definition (Flood frequency is the concept of the probable frequency of occurrence of a given flood.);
change note: 2016-03-31 09:22:18.0 [gee-cee] insert Definition (id: null text: Flood frequency is the concept of the probable frequency of occurrence of a given flood language code: en);
change note: 2016-03-31 09:21:40.0 [gee-cee] Insert Concept add broader relation (FLOOD FREQUENCY [bf470637-8aea-47a8-b075-40b394303747,158745] - FLOODS [7fdc339e-017f-4e4b-89a3-12e441a40bad,84799]);
in scheme: sciencekeywords
definition: Flood frequency is the concept of the probable frequency of occurrence of a given flood.
type: Concept