MYSIDS
change note: 2017-03-13 14:15:27.0 [mgenazzi] Definition added insert Definition (id: null text: Order Mysida, Phylum Arthropoda, are small shrimp-like crustaceans characterized by an eight segmented thorax concealed by a protective carapace, a six segmented abdomen, with a head that bears a pair of stalked eyes and two pairs of antennae language code: en);
in scheme: sciencekeywords
definition: Order Mysida, Phylum Arthropoda, are small shrimp-like crustaceans characterized by an eight segmented thorax concealed by a protective carapace, a six segmented abdomen, with a head that bears a pair of stalked eyes and two pairs of antennae
type: Concept

CRUSTACEANS
type: Concept