ICBEMP
in scheme: projects
definition: The mission of The Interior Columbia Ecosystem Management Project (ICBEMP) is to develop a scientifically sound and ecosystem based strategy for forest and rangelands administered by the Forest Service and Bureau of Land Management in the interior Columbia River basin and portions of the Klamath and Great Basins.
type: Concept

G - I
type: Concept