P - R
type: Concept

PNRA
in scheme: projects
definition: Programma Nazionale di Ricerche in Antartide (PNRA) "National Program of Searches in Antarctica" involves multiple studies in the Antarctic Region. For more information, link to "http://www.pnra.it/ANTARTIDE/HTML_it/indice.html"
type: Concept