HARVARD/FAS
in scheme: providers
definition: Founded in 1890, the Faculty of Arts and Sciences comprises more than 1000 faculty members, including dozens of Nobel Laureates and Pulitzer Prize winners.
type: Concept

ACADEMIC
type: Concept