A - C
type: Concept

AM-DTR
in scheme: projects
definition: The project addresses Antarctic meteorology and interaction between the atmosphere, snow and ice. The specific study topics are: - snow and ice surface albedo - radiative fluxes and cloud radiative forcing - snow properties and thermodynamics - mesoscale meteorology - boundary layer meteorology The project is carried out in co-operation between University of Helsinki and Finnish Meteorological Institute. Project URL: http://www.fimr.fi/en/etelamanner/etelamanner-tutkimus/tutkimusprojektit/meteorologia.html
type: Concept