KARST VALLEY
change note: 2013-04-01 13:38:13.0 [tbs1979] insert Definition (id: null text: A valley-scale, mid-size, closed depression otherwise meeting the definition of a sinkhole but also enclosing more than one smaller sinkhole and sinking stream. language code: en);
change note: 2013-03-05 09:36:31.0 [tbs1979] Insert Concept add broader relation (KARST VALLEY [c319a44c-b21a-491f-9cf0-65868507576c,82875] - KARST LANDFORMS [ac2d1035-1896-42c1-861b-042a917b6889,62827]);
in scheme: sciencekeywords
definition: A valley-scale, mid-size, closed depression otherwise meeting the definition of a sinkhole but also enclosing more than one smaller sinkhole and sinking stream.
type: Concept

KARST LANDFORMS
type: Concept