Surface
type: Concept

R/V UM
change note: 2021-11-18 09:21:21.0 [tstevens] Move Concepts delete broader relation (null); add broader relation (R/V UM [c37c3a9c-7eaa-4f3f-ae3a-dd1e62924388,826712] - Surface [59b97a6c-385e-40a2-8422-ecbdb6023c4c,835900]);
in scheme: platforms
definition: Built in 1973, the R/V Umitaka Maru operates in the western central Pacific Ocean, the eastern Indian Ocean, and the Coral Sea. This Japanese marine vessel is mainly used for fisheries. Group: Platform_Details Entry_ID: R/V UM Group: Platform_Identification Platform_Category: In Situ Ocean-based Platforms Platform_Series_or_Entity: SHIPS Short_Name: R/V UM Long_Name: R/V UMITAKA MARU End_Group Creation_Date: 2012-07-23 Online_Resource: http://www.researchvessels.org/country/Japan/umitaka_maru.html End_Group
type: Concept