GLACIER/ICE SHEET TOPOGRAPHY
change note: 2012-07-10 11:05:37.0 [mpmorahan] insert Definition (id: null text: Surface relief of the land. Topography usually is measured in meters above sea level. The topography can be very different from one location to another. Topography can be flat, or mountainous, or hilly. language code: en);
change note: 2012-06-26 13:30:43.0 [gee-cee] Insert Concept add broader relation (GLACIER/ICE SHEET TOPOGRAPHY [c3e4d439-bbb0-48c9-89eb-57d3a330627a,39919] - GLACIAL MEASUREMENTS [2d79af4f-d15f-40cc-b0bf-8f5c8eb1fce5,39907]);
in scheme: sciencekeywords
definition: Surface relief of the land. Topography usually is measured in meters above sea level. The topography can be very different from one location to another. Topography can be flat, or mountainous, or hilly.
type: Concept

GLACIAL MEASUREMENTS
type: Concept