Profilers/Sounders
type: Concept

TEMPERATURE PROFILERS
in scheme: instruments
definition: TEMPERATURE PROFILERS are remote sensing devices that receives electromagnetic or acoustic waves transmitted through, emitted by, or reflected from the atmosphere in order to produce a vertical profile (a graph showing the variation of a meteorological event with height) of one or more atmospheric quantities such as temperature.
type: Concept