TELECONNECTIONS
type: Concept

NORTH ATLANTIC OSCILLATION
change note: 2020-02-14 15:08:33.0 [tstevens] Remove Concepts delete narrower relation (null);
change note: 2012-06-25 10:43:09.0 [mpmorahan] Insert Concept add narrower relation (NORTH ATLANTIC OSCILLATION [c5e1c055-768e-4aa3-a0a1-3adfda8ecdca,22585] - NAO [19631138-70c8-4922-8052-821ec5ce093b,39711]);
in scheme: sciencekeywords
definition: The North Atlantic Oscillation (NAO) index is often defined as the difference of sea-level pressure between 2 stations situated close to the "centres of action" over Iceland and the Azores. Stykkisholmur (Iceland) is invariably used as the northern station, whereas either; Ponta Delgada (Azores) Lisbon (Portugal) Gibraltar are used as the southern station. Strong positive phases of the NAO tend to be associated with above-normal temperatures in the eastern United States and across northern Europe and below-normal temperatures in Greenland and oftentimes across southern Europe and the Middle East. They are also associated with above-normal precipitation over northern Europe and Scandinavia and below-normal precipitation over southern and central Europe. Opposite patterns of temperature and precipitation anomalies are typically observed during strong negative phases of the NAO. During particularly prolonged periods dominated by one particular phase of the NAO, abnormal height and temperature patterns are also often seen extending well into central Russia and north-central Siberia.
type: Concept