UCO/LASP/TCTE
type: Concept
change note: 2015-02-12 15:18:58.0 [saritz] insert Definition (id: null text: The TCTE includes a Total Irradiance Monitor to measure total solar irradiance (TSI). This new instrument is similar to that providing data from NASA’s SORCE mission since 2003, and will be continuing those measurements beyond the SORCE mission. The TCTE was launched on 19 Nov. 2013 as part of the Air Force’s STPSat-3 mission and is intended for a 1.5 year mission. Solar measurements commenced after spacecraft and instrument commissioning, and TCTE TSI data from Dec. 2013 to the present are available via this site. language code: en);
change note: 2015-02-12 15:15:13.0 [saritz] Insert Concept add broader relation (UCO/LASP/TCTE [c67e14b8-c237-4da7-bbf9-462f44ce9a21,106741] - ACADEMIC [7700280b-68ee-4644-bf5e-84e7a6adf897,66467]);
change note: 2015-02-12 15:16:11.0 [saritz] insert AltLabel (id: null text: TCTE Science Team, Laboratory for Atmospheric and Space Physics, University of Colorado language code: en);
in scheme: providers
definition: The TCTE includes a Total Irradiance Monitor to measure total solar irradiance (TSI). This new instrument is similar to that providing data from NASA’s SORCE mission since 2003, and will be continuing those measurements beyond the SORCE mission. The TCTE was launched on 19 Nov. 2013 as part of the Air Force’s STPSat-3 mission and is intended for a 1.5 year mission. Solar measurements commenced after spacecraft and instrument commissioning, and TCTE TSI data from Dec. 2013 to the present are available via this site. Source:

ACADEMIC
type: Concept