GMU/GPCP/PSPDC
in scheme: providers
definition: The Polar Satellite Precipitation Data Centre (PSPDC) is responsible for the processing, storage, and distribution of oceanic monthly rainfall from data collected by the Special Sensor Microwave Imager (SSM/I) on board the Defense Meteorological Satellite Program (DMSP) satellites.
type: Concept

ACADEMIC
type: Concept