FRANCE
type: Concept

FR/CNRS/UPMC/SBR
in scheme: providers
definition: Roscoff Biological Station is a center of research and teaching in the biology and marine ecology of north coast of Britain. Roscoff Biological Station is a joint research unit Pierre and Marie Curie University and CNRS.
type: Concept