SURFACE MOISTURE INDEX
change note: 2012-06-26 11:05:54.0 [gee-cee] Move Concepts add broader relation (SURFACE MOISTURE INDEX [c7503ec5-4e63-446a-9390-72c8a638a0af,23065] - LAND SURFACE/AGRICULTURE INDICATORS [112e71ec-c0a1-49a8-82d7-bcb317b45860,39835]); delete broader relation (null);
in scheme: sciencekeywords
definition: The Surface Moisture Index incorporates remote measures of vegetation condition coupled with radiometric thermal (temperature) data to characterize surface moisture conditions. It is mapped using two primary inputs; vegetation status as depicted by Normalized Difference Vegetation Index (NDVI) and surface temperature.
type: Concept

LAND SURFACE/AGRICULTURE INDICATORS
type: Concept