ICE DEPTH/THICKNESS
in scheme: sciencekeywords
definition: Ice depth or thickness refers to the extent of the ice below the surface of the water. The term is also used in river and lake ice studies. Remote sensing techniques (particularly radar and microwave) have been used to estimate ice thickness as have recently declassified submarine measurements of polar ice thickness.
type: Concept

SEA ICE
type: Concept