GROUND WATER FEATURES
type: Concept

FRESHWATER SPRINGS
change note: 2016-05-31 12:59:18.0 [gee-cee] update PrefLabel (FRESHWATER SPRINGS);
change note: 2016-04-04 09:00:23.0 [gee-cee] Move Concepts delete broader relation (null); add broader relation (SPRINGS [c87c086a-933f-44c7-a128-33279b36d7b5,85541] - GROUND WATER FEATURES [ae94befb-d08e-4350-8ebe-c0ba7ded8320,158823]);
change note: 2016-05-31 12:59:54.0 [gee-cee] update Definition (Pertaining to the zones where the water table intersects the land surface, and water flows out of an aquifer without needing to be pumped out of a well,); update Definition (http://www.watershedatlas.org);
change note: 2016-04-04 09:57:14.0 [gee-cee] update Definition (Pertaining to the zones where the water table intersects the land surface, and water flows out of an aquifer without needing to be pumped out of a well.); update Definition (Goudie, Andrew. 1997. The Encyclopedic Dictionary of Physical Geography. Blackwell Publishing, Malden, Massachusetts. );
in scheme: sciencekeywords
type: Concept
definition: Pertaining to the zones where the water table intersects the land surface, and water flows out of an aquifer without needing to be pumped out of a well,