ELTA
change note: 2013-05-13 09:28:10.0 [tbs1979] insert AltLabel (id: null text: EROS Long Term Archive language code: en);
change note: 2013-05-13 09:27:04.0 [tbs1979] Insert Concept add broader relation (ELTA [c8ee049e-dd41-4566-ae69-0e11c655e41a,105125] - D - F [24cf4b0e-4464-4edb-8f0c-415e851a6d79,77495]);
in scheme: projects
definition: The U.S. Geological Survey's (USGS) Long Term Archive (LTA) at the National Center for Earth Resource Observations and Science (EROS) in Sioux Falls, SD is one of the largest civilian remote sensing data archives. It contains a comprehensive record of the Earth's changing land surface. Scientists from around the world depend on this archive to conduct research on changes that affect our environment, resources, health, and safety. Time series images are a valuable resource for scientists, disaster managers, engineers, educators, and the general public. USGS EROS has archived, managed, and preserved land remote sensing data for more than 35 years and is a leader in preserving land remote sensing imagery. USGS EROS has a mandate to provide access and data preservation support for its land remote sensing data archive. The U.S. Geological Survey (USGS) National Center for Earth Resource Observations and Science (EROS) initially operated in an office in downtown Sioux Falls, South Dakota that opened on September 28, 1971. The Karl E. Mundt Federal Building is located in the countryside about 15 miles northeast of Sioux Falls. Built to exclusively support the activities of EROS, the building was officially dedicated on August 7, 1973. NASA and USGS announced on August 28,1990 that EROS would process, archive and distribute land processes data received from EOS satellites, thus establishing a Distributed Active Archive Center, or DAAC. A 65,000 square-foot addition to the building was constructed to support this new role, and was dedicated on August 19, 1996. [Summary provided by the U.S. Geological Survey.]
type: Concept

D - F
type: Concept