ULP/EOST
in scheme: providers
definition: School and Observatory of Earth Sciences (EOST) is dedicated to teaching activities and research in the field of Earth sciences and the environment and ensures tasks Observatory set nationally and internationally . Summary Provided by: http://translate.google.com/translate?hl=en&sl=fr&u=http://www-ulp.u-strasbg.fr/article.php/0/13/1-080-313-700/ecole-et-observatoire-des-sciences-de-la-terre-eost&sa=X&oi=translate&resnum=1&ct=result&prev=/search%3Fq%3DECOLE%2BET%2BOBSERVATOIRE%2BDES%2BSCIENCES%2BDE%2BLA%2BTERRE%2B(EOST),%2BUNIVERSITE%2BLOUIS%2BPASTEUR%2BSTRASBOURG%2B(ULP)%26hl%3Den%26client%3Dfirefox-a%26rls%3Dorg.mozilla:en-US:official%26hs%3D48e%26sa%3DG
type: Concept

ACADEMIC
type: Concept