LIDAR BACKSCATTER
in scheme: sciencekeywords
definition: The scattering of radiation in a direction opposite to that of the incident radiation due to reflection of the transmitted lidar signal back towards the instrument (from the Radar Backscatter definition).
type: Concept

LIDAR
type: Concept