RIPPLES
change note: 2013-03-22 09:40:04.0 [tbs1979] insert Definition (id: null text: Sedimentary structures (i.e. bedforms of the lower flow regime) and indicate agitation by water (current or waves) or wind. language code: en);
change note: 2013-03-05 09:17:57.0 [tbs1979] Insert Concept add broader relation (RIPPLES [cae41424-161f-4378-a1a4-62cd76c61143,82839] - AEOLIAN LANDFORMS [26637389-f4f6-47a0-9c3d-17e93ab99dea,64129]);
in scheme: sciencekeywords
definition: Sedimentary structures (i.e. bedforms of the lower flow regime) and indicate agitation by water (current or waves) or wind.
type: Concept

AEOLIAN LANDFORMS
type: Concept