Probes
type: Concept

WCR
change note: 2013-10-11 11:54:21.0 [saritz] Added definition. insert AltLabel (id: null text: Water Content Reflectometer language code: en); insert Definition (id: null text: The Water Content Reflectometer measures the volumetric water content of porous media using time-domain measurement methods. The reflectometer connects directly to the single-ended analog input of a datalogger. The datalogger period or frequency output can be converted to volumetric water content using calibration values. language code: en);
change note: 2013-10-11 11:50:29.0 [saritz] Insert Concept add broader relation (WCR [caeac279-114d-4035-bfb6-f3509defe610,105877] - Probes [def72d78-3c2f-4f46-91e7-259a0e63e2de,74895]);
in scheme: instruments
definition: The Water Content Reflectometer measures the volumetric water content of porous media using time-domain measurement methods. The reflectometer connects directly to the single-ended analog input of a datalogger. The datalogger period or frequency output can be converted to volumetric water content using calibration values. Source: http://s.campbellsci.com/documents/us/product-brochures/b_cs615.pdf Group: Instrument_Details Entry_ID: WCR Group: Instrument_Identification Instrument_Category: In Situ/Laboratory Instruments Instrument_Class: Probes Short_Name: WCR Long_Name: Water Content Reflectometer End_Group Online_Resource: http://s.campbellsci.com/documents/us/product-brochures/b_cs615.pdf Creation_Date: 2013-10-16 End_Group
type: Concept