ACADEMIC
type: Concept

UAZ/AGLS/SRNR
in scheme: providers
definition: The School of Natural Resources conducts research that provides the foundation of knowledge and management skills necessary to manage our valuable natural resources, with considerable integration of disciplinary resources within the University of Arizona and through cooperation with federal and state agencies and non-government organizations. Website: "http://www.ag.arizona.edu/srnr/index.php" [Summary provided by the University of Arizona.]
type: Concept