Johnson-Sea-Link II
type: Concept
change note: 2020-01-21 14:26:31.0 [tstevens] insert Definition (id: null text: The Johnson-Sea-Link I and II were retired by Harbor Branch Oceanographic Institution in 2011 after their support ship the R/V Seward Johnson was sold to Cepemar Environmental Services of Brazil. The Johnson-Sea-Link (JSL) I and II are owned and operated by Harbor Branch Oceanographic Institution. At 23.6 ft long, 10.9 ft high and 8.3 ft wide, these highly maneuverable submersibles can dive to a depth of 3,000 ft and travel at a maximum speed of one knot. Edwin Albert Link, engineer, inventor, and friend of Harbor Branch founder Seward Johnson, working at Harbor Branch, designed and built the JSL in 1971, at Mr. Johnson’s request. Harbor Branch constructed the JSL II, which is virtually identical to the JSL I, in 1975. The JSL has two separate pressure hulls and can accommodate four people. Aft compartment occupants enter the sub through a bottom-facing 20 inch-wide hatch. The front chamber, which contains the sub’s controls, is a 5-ft-diameter sphere made of five-in thick, clear acrylic. It provides a panoramic view for the pilot and one observer. Because acrylic is a good insulator and hampers conductivity of cold ocean temperatures, the front compartment actually requires air conditioning. The second chamber, the stern compartment, houses another crew member and a second observer. The occupants have access to two side view ports and a video monitor. language code: en);
change note: 2022-02-22 14:29:50.0 [tstevens] update Definition (NOAA);
change note: 2021-11-18 09:17:30.0 [tstevens] Move Concepts delete broader relation (null); add broader relation (Johnson-Sea-Link II [cb5ab3cc-48d1-4b0c-b72b-700a6faee11e,826744] - Subsurface [35f1c0af-8379-4812-a130-08d84514fc98,835899]);
change note: 2020-01-21 12:35:05.0 [tstevens] Insert Concept add broader relation (Johnson-Sea-Link II [cb5ab3cc-48d1-4b0c-b72b-700a6faee11e,559779] - HOV [63c8aa1d-6efc-4943-8891-3a1cd520dde0,559759]);
in scheme: platforms
definition: The Johnson-Sea-Link I and II were retired by Harbor Branch Oceanographic Institution in 2011 after their support ship the R/V Seward Johnson was sold to Cepemar Environmental Services of Brazil. The Johnson-Sea-Link (JSL) I and II are owned and operated by Harbor Branch Oceanographic Institution. At 23.6 ft long, 10.9 ft high and 8.3 ft wide, these highly maneuverable submersibles can dive to a depth of 3,000 ft and travel at a maximum speed of one knot. Edwin Albert Link, engineer, inventor, and friend of Harbor Branch founder Seward Johnson, working at Harbor Branch, designed and built the JSL in 1971, at Mr. Johnson’s request. Harbor Branch constructed the JSL II, which is virtually identical to the JSL I, in 1975. The JSL has two separate pressure hulls and can accommodate four people. Aft compartment occupants enter the sub through a bottom-facing 20 inch-wide hatch. The front chamber, which contains the sub’s controls, is a 5-ft-diameter sphere made of five-in thick, clear acrylic. It provides a panoramic view for the pilot and one observer. Because acrylic is a good insulator and hampers conductivity of cold ocean temperatures, the front compartment actually requires air conditioning. The second chamber, the stern compartment, houses another crew member and a second observer. The occupants have access to two side view ports and a video monitor.

Subsurface
type: Concept