CA/NFLD/FRA/FB
in scheme: providers
definition: This database contains vegetation information for both forested and non-forested areas. For forested areas this includes tree species, height, age, crown density, and site. For non-forested areas it includes hydrology, wetlands, barren, scrub, cleared areas, and residential. Summary Provided by: http://geodiscover.cgdi.ca/gdp/search?action=entrySummary&entryType=productCollection&entryId=6075&entryLang=en
type: Concept

CANADA
type: Concept