Permanent Land Sites
type: Concept

BAPMON
change note: 2022-02-08 09:37:05.0 [tstevens] update Definition (A network of stations that collect rain water samples which are sent to the Central Chemical Laboratory at Pune for complete chemical analysis. Acidity of rain and mineral deposition is determined from these. Atmospheric turbidity which indicates the columnar aerosol load of the atmosphere, is also measured at these stations using sunphotmeters. These data are important for identifying the current levels of pollution as well as for study of the long term trends in the concentration of trace constituents of the atmosphere which may affect the environment and induce a climate change.);
change note: 2021-11-17 13:53:33.0 [tstevens] Move Concepts delete broader relation (null); add broader relation (BAPMON [cb5fc8b1-e8e3-4984-84ac-03f6f4d8a662,826745] - Permanent Land Sites [0ec10fd9-492c-498a-b6d8-e2840cc3643b,835887]);
in scheme: platforms
definition: A network of stations that collect rain water samples which are sent to the Central Chemical Laboratory at Pune for complete chemical analysis. Acidity of rain and mineral deposition is determined from these. Atmospheric turbidity which indicates the columnar aerosol load of the atmosphere, is also measured at these stations using sunphotmeters. These data are important for identifying the current levels of pollution as well as for study of the long term trends in the concentration of trace constituents of the atmosphere which may affect the environment and induce a climate change.
type: Concept