E-BAM
change note: 2020-04-14 14:31:48.0 [tstevens] insert AltLabel (id: null category: primary text: Environmental Beta-Attenuation Mass Monitor language code: en); insert Definition (id: null text: The Met One Instruments E-BAM is in a class of its own as a portable, real-time beta gauge, which is comparable to U.S. EPA methods for PM2.5 and PM10 particulate measurements. The E-BAM has been built to satisfy users, regulators, and those from the health and safety community by providing truly accurate, precise, real time measurement of fine particulate matter. It is rugged, portable, battery operated, and deployable in 15 minutes. language code: en);
change note: 2020-04-14 14:30:46.0 [tstevens] Insert Concept add broader relation (E-BAM [cb8f849f-bbe5-4c62-9a50-d729718ad980,559933] - Gauges [271601ce-3e85-4090-b70d-d28a70095c2d,543471]);
in scheme: instruments
definition: The Met One Instruments E-BAM is in a class of its own as a portable, real-time beta gauge, which is comparable to U.S. EPA methods for PM2.5 and PM10 particulate measurements. The E-BAM has been built to satisfy users, regulators, and those from the health and safety community by providing truly accurate, precise, real time measurement of fine particulate matter. It is rugged, portable, battery operated, and deployable in 15 minutes.
type: Concept

Gauges
type: Concept