PlanetScope
change note: 2019-05-06 07:29:44.0 [mmorahan] insert Definition (id: null text: The PlanetScope satellite constellation consists of multiple launches of groups of individual satellites (DOVEs). Therefore, on-orbit capacity is constantly improving in capability or quantity, with technology improvements deployed at a rapid pace. Each DOVE satellite is a CubeSat 3U form factor (10 cm by 10 cm by 30 cm). The complete PlanetScope constellation of approximately 150 active satellites is able to image the entire land surface of the Earth every day (equating to a daily collection capacity of 350 million km²/day). The constellation is constantly "on" and does not require ordering or acquisition planning. language code: en); insert WeightedRelation (id: null related concept uuid: 6fffd5bf-1d22-487a-8b4c-495992ef3b28 relationship type: null relationship value: null generated by: null);
change note: 2019-05-06 07:26:29.0 [mmorahan] Insert Concept add broader relation (PlanetScope [ccae4c79-b985-4be6-b146-5c1a1a395e03,368769] - Imaging Spectrometers/Radiometers [944b7691-af37-4fb4-9393-c114e7997829,347979]);
in scheme: instruments
definition: The PlanetScope satellite constellation consists of multiple launches of groups of individual satellites (DOVEs). Therefore, on-orbit capacity is constantly improving in capability or quantity, with technology improvements deployed at a rapid pace. Each DOVE satellite is a CubeSat 3U form factor (10 cm by 10 cm by 30 cm). The complete PlanetScope constellation of approximately 150 active satellites is able to image the entire land surface of the Earth every day (equating to a daily collection capacity of 350 million km²/day). The constellation is constantly "on" and does not require ordering or acquisition planning.
type: Concept

Imaging Spectrometers/Radiometers
type: Concept