IT/CNR/IROE
change note: 2016-11-15 11:42:30.0 [gee-cee] Updated URL update Definition (The LID data center holds atmospheric datasets from Research Groups operating in Antarctica in the frame of PNRA with LIDAR stations. Website: "http://www.irea.cnr.it/en/");
in scheme: providers
definition: The LID data center holds atmospheric datasets from Research Groups operating in Antarctica in the frame of PNRA with LIDAR stations. Website: "http://lid.iroe.fi.cnr.it/"
type: Concept

ITALY
type: Concept