SOIL FERTILITY
change note: 2017-03-10 09:17:01.0 [tstevens] update Definition (The quality of a soil that enables it to provide essential chemical elements in quantities and proportions for the growth of specified plants.); update Definition (The Nature and Properties of Soils, Prentice Hall, 1996. );
in scheme: sciencekeywords
definition: The quality of a soil that enables it to provide essential chemical elements in quantities and proportions for the growth of specified plants.
type: Concept

SOILS
type: Concept