UTS
change note: 2012-08-01 11:24:59.0 [aaleman] Insert Concept add broader relation (UTS [ce27322f-42a5-4eb7-8d1f-66eda9750ff7,40447] - ACADEMIC [7700280b-68ee-4644-bf5e-84e7a6adf897,24357]);
in scheme: providers
definition: UTS is a dynamic and innovative university in central Sydney. One of Australia’s leading universities of technology, UTS has a distinct model of learning, strong research performance and a leading reputation for engagement with industry and the professions. UTS has a culturally diverse campus life and vibrant international exchange study and research programs that prepare graduates for the workplaces of today and the future. Our City campus is in the heart of Sydney's creative precinct and alongside Sydney's central business district, and our Kuring-gai campus is in a bushland setting in northern Sydney. Over the next six years, our City Campus Master Plan will deliver a state-of-the-art campus to meet the needs of 21st century students. Our Strategic Plan outlines our vision to be a world‑leading university of technology and provides a strong statement about UTS’s aspirations for our third decade. UTS is part of the Australian Technology Network of universities: a group of five prominent universities committed to working with industry and government to deliver practical and professional courses. With a total enrolment of over 35,000 students, UTS is one of the largest universities in Australia.
type: Concept

ACADEMIC
type: Concept