MAXIMUM/MINIMUM TEMPERATURE
type: Concept

24 HOUR MAXIMUM TEMPERATURE
change note: 2013-10-16 18:32:15.0 [gee-cee] added new definition insert Definition (id: null text: The highest temperature reported for a given location during a (24 hour) period. language code: en);
change note: 2013-09-04 14:09:21.0 [epneff] Insert Concept add broader relation (24 HOUR MAXIMUM TEMPERATURE [ce6a6b3a-df4f-4bd7-a931-7ee874ee9efe,105791] - MAXIMUM/MINIMUM TEMPERATURE [5164162a-60eb-4c94-a0f0-2caaa3bb1754,86703]);
in scheme: sciencekeywords
definition: The highest temperature reported for a given location during a (24 hour) period.
type: Concept