ARGENTINA
type: Concept

AR/CDA
change note: 2015-10-16 13:27:48.0 [aaleman] updated description update Definition (The National Antarctic Data Centre, Argentina (Centro de Datos Antárticos, Argentina, CDA) was created on October 12th, 2000, under the Scientific Coordination of the Instituto Antártico Argentino-Dirección Nacional del Antártico. At present the metadata is generated and updated using the docBUILDER online tool, provided by GCMD to the AMD. CDA continous task is to update the older metadata that already existed in the AMD, as well to produce new entries. [Summary provided by the National Antarctic Data Centre, Argentina]);
in scheme: providers
definition: The National Antarctic Data Centre, Argentina (Centro de Datos Antárticos, Argentina, CDA) was created on October 12th, 2000, under the Scientific Coordination of the Instituto Antártico Argentino-Dirección Nacional del Antártico. At present the metadata is generated and updated using the docBUILDER online tool, provided by GCMD to the AMD. CDA continuous task is to update the older metadata that already existed in the AMD, as well to produce new entries. [Summary provided by the National Antarctic Data Centre, Argentina]
type: Concept