SPECIFIC GRAVITY
change note: 2013-03-21 15:03:10.0 [tbs1979] insert Definition (id: null text: Identified as the density of the mineral. language code: en);
change note: 2013-03-05 13:15:03.0 [tbs1979] Insert Concept add broader relation (SPECIFIC GRAVITY [cef686dd-4efe-4e4a-b6ef-360879b20dc9,83041] - MINERAL PHYSICAL/OPTICAL PROPERTIES [da269095-7270-4a0d-8b43-2c85bd42dd90,83031]);
in scheme: sciencekeywords
definition: Identified as the density of the mineral.
type: Concept

MINERAL PHYSICAL/OPTICAL PROPERTIES
type: Concept