GETECH
in scheme: providers
definition: GETECH provides gravity and magnetic data and related management and interpretation services to the international oil and mining exploration industry. By using gravity and magnetic data, and involving GETECH early in exploration programmes, companies have discovered they can be more cost effective and focused in their decision making. Website: "http://www.getech.com/" [Summary provided by GETECH.]
type: Concept

COMMERCIAL
type: Concept