MSU-GS
change note: 2015-08-03 13:09:58.0 [mpmorahan] insert AltLabel (id: null text: Multispectral scanning imager-radiometer language code: en);
change note: 2015-08-03 13:09:10.0 [mpmorahan] Insert Concept add broader relation (MSU-GS [d03771c4-d795-4066-86d2-40e200df134b,158183] - Imaging Spectrometers/Radiometers [944b7691-af37-4fb4-9393-c114e7997829,144651]);
in scheme: instruments
definition: Multispectral scanning imager-radiometer (MSU-GS) Group: Instrument_Details Entry_ID: MSU-GS Group: Instrument_Identification Instrument_Category: Earth Remote Sensing Instruments Instrument_Class: Passive Remote Sensing Short_Name: MSU-GS Long_Name: Multispectral scanning imager-radiometer End_Group Group: Associated_Platforms Short_Name: Elektro-L N1 End_Group Group: Spectral_Frequency_Information Wavelength_Keyword: Visible Spectral_Frequency_Coverage_Range: 0.5 μm - 0.65 μm End_Group Group: Spectral_Frequency_Information Wavelength_Keyword: Visible Spectral_Frequency_Coverage_Range: 0.65 μm - 0.8 μm End_Group Group: Spectral_Frequency_Information Wavelength_Keyword: Near Infrared Spectral_Frequency_Coverage_Range: 0.8 μm - 0.9 μm End_Group Group: Spectral_Frequency_Information Wavelength_Keyword: Infrared > Thermal Spectral_Frequency_Coverage_Range: 3.5 μm - 4.01 μm End_Group Group: Spectral_Frequency_Information Wavelength_Keyword: Infrared > Thermal Spectral_Frequency_Coverage_Range: 5.7 μm - 7 μm End_Group Group: Spectral_Frequency_Information Wavelength_Keyword: Infrared > Thermal Spectral_Frequency_Coverage_Range: 7,5 μm - 8,5 μm End_Group Group: Spectral_Frequency_Information Wavelength_Keyword: Infrared > Thermal Spectral_Frequency_Coverage_Range: 8.2 μm - 9,2 μm End_Group Group: Spectral_Frequency_Information Wavelength_Keyword: Infrared > Thermal Spectral_Frequency_Coverage_Range: 9.2 μm – 10.2 μm End_Group Group: Spectral_Frequency_Information Wavelength_Keyword: Infrared > Thermal Spectral_Frequency_Coverage_Range: 10.2 μm - 11.2 μm End_Group Group: Spectral_Frequency_Information Wavelength_Keyword: Infrared > Thermal Spectral_Frequency_Coverage_Range: 11.2 μm - 12.5 μm End_Group Online_Resource: http://planeta.infospace.ru/electro/html/msu-gs.html Online_Resource: http://www.wmo-sat.info/oscar/instruments/view/324 Sample_Image: http://www.mcc.rsa.ru/Pic/electra/3.jpg Creation_Date: 2015-01-26 Group: Instrument_Logistics Instrument_Owner: Russia/ROSCO…
type: Concept

Imaging Spectrometers/Radiometers
type: Concept