GOES-10 Imager
change note: 2017-12-06 08:08:34.0 [tstevens] insert AltLabel (id: null category: primary text: Geostationary Operational Environmental Satellite 10-Imager language code: en); insert Definition (id: null text: The GOES-10 Imager is a multi-purpose imagery and wind derivation by tracking clouds and water vapor features using 5 channels covering VIS, MWIR, and TIR. language code: en);
change note: 2017-12-06 08:07:34.0 [tstevens] Insert Concept add broader relation (GOES-10 Imager [d0e5bb89-a379-4341-976a-58a2f8feaf4f,310467] - Imaging Spectrometers/Radiometers [944b7691-af37-4fb4-9393-c114e7997829,290619]);
in scheme: instruments
definition: The GOES-10 Imager is a multi-purpose imagery and wind derivation by tracking clouds and water vapor features using 5 channels covering VIS, MWIR, and TIR.
type: Concept

Imaging Spectrometers/Radiometers
type: Concept