A - C
type: Concept

CD
in scheme: projects
definition: China Dimensions (CD) studies change in world populations and how they affect the global environemnt. Thier website offers a collection of natural science and socioenomic research and educational activities. It enables reserchers and the public to obtain accurate and timely information on the world's most populous country. Form more information, link to "http://sedac.ciesin.org/china/"
type: Concept