INFRARED IMAGERY
in scheme: sciencekeywords
definition: A reproduction of an object by imaging the infrared radiation coming from the object or reflected by the object.
type: Concept

INFRARED WAVELENGTHS
type: Concept