UC-DAVIS/ANR/IPM
in scheme: providers
definition: The University of California, Davis Integrated Pest Management Program provides information on how to manage and identify insects, mites, diseases, nematodes, weeds and develops tools to how to make pests related decisions. Educational materials and publications are also provided. Website: "http://axp.ipm.ucdavis.edu/" [Summary provided by the University of California, Davis.]
type: Concept

ACADEMIC
type: Concept