GOES-11
change note: 2017-09-01 12:52:22.0 [sritz] insert Definition (id: null text: Update 2011-12-12: GOES-15 replaced GOES-11 as the GOES-West operational spacecraft on 2011-12-06, Source: http://noaasis.noaa.gov/NOAASIS/ml/status.html ] [Text For Archival Purposes only] GOES-11 (GOES-L) was launched May 3, 2000 from Cape Canaveral Air Station. The spacecraft will continue the long term geostationary monitoring of U.S. weather. The spacecraft will monitor hurricanes, severe thunderstorms, flash floods, and other severe weather as well as provide short-term weather forecasting or nowcasting. Combined with Doppler radar and automated surface weather stations, real-time GOES data will greatly aid weather foecasters in providing better warnings of severe weather. NOAA's National Environmmental Satellite, Data, and Information Service will operate GOES. The instrument package includes a GOES I-M Imager and GOES I-M Sounder. For more information see: https://www.ospo.noaa.gov/Operations/GOES/index.html language code: en);
change note: 2017-09-01 12:46:41.0 [sritz] Insert Concept add broader relation (GOES-11 [d1c98f16-ae13-45a0-b1bf-de4fd2a5b1c7,310115] - GOES [6e332c25-caeb-4917-afb6-af757bcecd72,310071]);
in scheme: platforms
definition: Update 2011-12-12: GOES-15 replaced GOES-11 as the GOES-West operational spacecraft on 2011-12-06, Source: http://noaasis.noaa.gov/NOAASIS/ml/status.html ] [Text For Archival Purposes only] GOES-11 (GOES-L) was launched May 3, 2000 from Cape Canaveral Air Station. The spacecraft will continue the long term geostationary monitoring of U.S. weather. The spacecraft will monitor hurricanes, severe thunderstorms, flash floods, and other severe weather as well as provide short-term weather forecasting or nowcasting. Combined with Doppler radar and automated surface weather stations, real-time GOES data will greatly aid weather foecasters in providing better warnings of severe weather. NOAA's National Environmmental Satellite, Data, and Information Service will operate GOES. The instrument package includes a GOES I-M Imager and GOES I-M Sounder. For more information see: https://www.ospo.noaa.gov/Operations/GOES/index.html
type: Concept

Geostationary Operational Environmental Satellite (GOES)
type: Concept