ORGANIC CARBON
in scheme: sciencekeywords
definition: Carbon species that are hydrocarbons or hydrocarbon derivatives. Variables such as particulate organic carbon (POC) are included as detailed variables under organic carbon.
type: Concept

OCEAN CHEMISTRY
type: Concept