OSMOMETERS
change note: 2021-08-05 16:28:03.0 [sritz] insert AltLabel (id: null category: primary text: OSMOMETERS language code: en);
in scheme: instruments
definition: OSMOMETERS are devices for measuring soil water amounts, especially under roads.
type: Concept

Probes
type: Concept